Clinic Duty Stats

From cpt


Legend: Added Clinic Duty project: ⇑, Removed Clinic Duty project: ⇓, Entered column: ⇒, Exited column: ⇐

Task Column Date
T268713: Inject dependencies into RevDelList classes Added Project 25 November 2020
T267080: Helper for deprecating method overrides Inbox 24 November 2020
T267080: Helper for deprecating method overrides Later 24 November 2020
T267080: Helper for deprecating method overrides Added Project 24 November 2020
T267445: UserGetLanguageObjectHook is unsafe: "User::loadFromSession called before the end of Setup.php" Inbox 24 November 2020
T267445: UserGetLanguageObjectHook is unsafe: "User::loadFromSession called before the end of Setup.php" Later 24 November 2020
T267445: UserGetLanguageObjectHook is unsafe: "User::loadFromSession called before the end of Setup.php" Added Project 24 November 2020
T268041: Deprecate and remove ContentHandler::getContentText() and $wgContentHandlerTextFallback Inbox 24 November 2020
T268041: Deprecate and remove ContentHandler::getContentText() and $wgContentHandlerTextFallback Later 24 November 2020
T268041: Deprecate and remove ContentHandler::getContentText() and $wgContentHandlerTextFallback Added Project 24 November 2020
T268189: maintenance/update.php fails with error if populateArchiveRevId.php finds duplicate ar_rev_id values in archive table Inbox 24 November 2020
T268189: maintenance/update.php fails with error if populateArchiveRevId.php finds duplicate ar_rev_id values in archive table Later 24 November 2020
T268189: maintenance/update.php fails with error if populateArchiveRevId.php finds duplicate ar_rev_id values in archive table Added Project 24 November 2020
T268293: Duplicate rows in ipblocks table causing exceptions from maintenance/update.php in MW 1.35 Inbox 24 November 2020
T268293: Duplicate rows in ipblocks table causing exceptions from maintenance/update.php in MW 1.35 Later 24 November 2020
T268293: Duplicate rows in ipblocks table causing exceptions from maintenance/update.php in MW 1.35 Added Project 24 November 2020
T268585: "Process cache for 'en' should be set by now" during abstract dumps Added Project 24 November 2020
T246377: ObjectFactory needs a way to inject configuration settings into objects. Added Project 22 November 2020
T248908: composer-merge-plugin support for composer 2.0 Inbox 19 November 2020
T248908: composer-merge-plugin support for composer 2.0 Later 19 November 2020
T248908: composer-merge-plugin support for composer 2.0 Added Project 19 November 2020
T211910: Don't show misleading messages on Special:Contributions for IP ranges outside the CIDR limit External Code Review Needed 19 November 2020
T211910: Don't show misleading messages on Special:Contributions for IP ranges outside the CIDR limit External Code Review In Progress 19 November 2020
T248686: Allow subclasses of ApiBase to be used in phpunit tests without MediaWiki being initialized External Code Review Needed 19 November 2020
T248686: Allow subclasses of ApiBase to be used in phpunit tests without MediaWiki being initialized External Code Review In Progress 19 November 2020
T264794: SessionManager should not emit Set-Cookies on session renewal External Code Review Needed 19 November 2020
T264794: SessionManager should not emit Set-Cookies on session renewal External Code Review In Progress 19 November 2020
T267080: Helper for deprecating method overrides Removed Project 19 November 2020
T239459: service-runner apps running on kubernetes emit logs with log level 50 Ready 18 November 2020
T239459: service-runner apps running on kubernetes emit logs with log level 50 Waiting for deployment 18 November 2020
T239459: service-runner apps running on kubernetes emit logs with log level 50 Added Project 18 November 2020
T268148: Retry submitting processMediaModeration jobs Removed Project 18 November 2020
T268148: Retry submitting processMediaModeration jobs Added Project 18 November 2020
T148304: Incorrect spacing for \mathbin and \mathrel Waiting for deployment 17 November 2020
T148304: Incorrect spacing for \mathbin and \mathrel Done 17 November 2020
T263927: MediaWiki user and password fields should have the proper autocomplete value External Code Review Needed 17 November 2020
T263927: MediaWiki user and password fields should have the proper autocomplete value External Code Review Completed 17 November 2020
T267520: Translation pages are updated after a long delay on Wikimedia sites Waiting for deployment 17 November 2020
T267520: Translation pages are updated after a long delay on Wikimedia sites Done 17 November 2020
T263295: Setup Git repo and CI for shellbox Waiting for Review 17 November 2020
T263295: Setup Git repo and CI for shellbox Blocked Externally 17 November 2020
T248237: IPUtils 2.0.0 test failures on MW core Waiting for Review 17 November 2020
T248237: IPUtils 2.0.0 test failures on MW core Blocked Externally 17 November 2020
T36801: Function applyDiffStyle uses regexes which do not detect CSS classes appropriately Removed Project 17 November 2020
T36801: Function applyDiffStyle uses regexes which do not detect CSS classes appropriately Added Project 17 November 2020
T264514: No documentation on how to set $wgOAuth2PrivateKey and $wgOAuth2PublicKey Inbox 17 November 2020
T264514: No documentation on how to set $wgOAuth2PrivateKey and $wgOAuth2PublicKey Later 17 November 2020
T267468: populateContentTables.php fails multiple times Removed Project 17 November 2020
T267468: populateContentTables.php fails multiple times Added Project 17 November 2020
T266991: Translate characterEditStats.php script uses Revision::getQueryInfo Inbox 17 November 2020
T266991: Translate characterEditStats.php script uses Revision::getQueryInfo Later 17 November 2020
T263340: "Fatal Exception of Type InvalidArgumentException" when viewing pages with broken history caused by Special:MergeHistory Removed Project 17 November 2020
T263340: "Fatal Exception of Type InvalidArgumentException" when viewing pages with broken history caused by Special:MergeHistory Added Project 17 November 2020
T266515: Set ENV SERVERGROUP for jobrunner MW web requests Added Project 17 November 2020
T263927: MediaWiki user and password fields should have the proper autocomplete value Added Project 17 November 2020
T268008: Argument 2 passed to GrowthExperiments\NewcomerTasks\TaskSuggester\CacheDecorator::suggest() must be of the type array, null given, called in /srv/mediawiki/php-1.36.0-wmf.16/extensions/GrowthExperiments/includes/NewcomerTasks/TaskSuggester/NewcomerTasksCacheRefreshJob.php on line 35 Inbox 17 November 2020
T268008: Argument 2 passed to GrowthExperiments\NewcomerTasks\TaskSuggester\CacheDecorator::suggest() must be of the type array, null given, called in /srv/mediawiki/php-1.36.0-wmf.16/extensions/GrowthExperiments/includes/NewcomerTasks/TaskSuggester/NewcomerTasksCacheRefreshJob.php on line 35 Later 17 November 2020
T268008: Argument 2 passed to GrowthExperiments\NewcomerTasks\TaskSuggester\CacheDecorator::suggest() must be of the type array, null given, called in /srv/mediawiki/php-1.36.0-wmf.16/extensions/GrowthExperiments/includes/NewcomerTasks/TaskSuggester/NewcomerTasksCacheRefreshJob.php on line 35 Added Project 17 November 2020
T267468: populateContentTables.php fails multiple times Later 17 November 2020
T267468: populateContentTables.php fails multiple times Inbox 17 November 2020
T263340: "Fatal Exception of Type InvalidArgumentException" when viewing pages with broken history caused by Special:MergeHistory Done 16 November 2020
T263340: "Fatal Exception of Type InvalidArgumentException" when viewing pages with broken history caused by Special:MergeHistory Inbox 16 November 2020
T252907: Reduce public variables and methods in EditPage External Code Review Completed 10 November 2020
T252907: Reduce public variables and methods in EditPage External Code Review Needed 10 November 2020
T218170: Finish removal of ukwikimedia wiki Teleport 10 November 2020
T218170: Finish removal of ukwikimedia wiki Later 10 November 2020
T218170: Finish removal of ukwikimedia wiki Added Project 10 November 2020
T267080: Helper for deprecating method overrides Added Project 10 November 2020
T47096: Add a way to transclude template or other page in the correct language Added Project 10 November 2020
T264101: Find a way for the push service to authenticate to MediaWiki in beta and production Added Project 10 November 2020
T264516: Documentation does not mention that OAuth2 does NOT support "use as prefix" option for callback URL Inbox 10 November 2020
T264516: Documentation does not mention that OAuth2 does NOT support "use as prefix" option for callback URL Later 10 November 2020
T264516: Documentation does not mention that OAuth2 does NOT support "use as prefix" option for callback URL Added Project 10 November 2020
T265628: Identify which extensions' tests make HTTP requests and so are now broken post-T262443 Inbox 10 November 2020
T265628: Identify which extensions' tests make HTTP requests and so are now broken post-T262443 Later 10 November 2020
T265628: Identify which extensions' tests make HTTP requests and so are now broken post-T262443 Added Project 10 November 2020
T258108: Turn off auto-watchlist preferences for bots Inbox 10 November 2020
T258108: Turn off auto-watchlist preferences for bots Later 10 November 2020
T258108: Turn off auto-watchlist preferences for bots Added Project 10 November 2020
T264514: No documentation on how to set $wgOAuth2PrivateKey and $wgOAuth2PublicKey Added Project 10 November 2020
T264735: MultiHttpClient has hard-coded deprecated cURL option used by CdnCacheUpdate Inbox 10 November 2020
T264735: MultiHttpClient has hard-coded deprecated cURL option used by CdnCacheUpdate Later 10 November 2020
T264735: MultiHttpClient has hard-coded deprecated cURL option used by CdnCacheUpdate Added Project 10 November 2020
T267141: Please start the November run of the MediaWiki CSAM Scanning extension Inbox 10 November 2020
T267141: Please start the November run of the MediaWiki CSAM Scanning extension Doing 10 November 2020
T267141: Please start the November run of the MediaWiki CSAM Scanning extension Added Project 10 November 2020
T267365: Develop maintenance script for enumerating Swift media files from MediaWiki (for backup processing) Inbox 10 November 2020
T267365: Develop maintenance script for enumerating Swift media files from MediaWiki (for backup processing) Later 10 November 2020
T267365: Develop maintenance script for enumerating Swift media files from MediaWiki (for backup processing) Added Project 10 November 2020
T267468: populateContentTables.php fails multiple times Inbox 10 November 2020
T267468: populateContentTables.php fails multiple times Later 10 November 2020
T267468: populateContentTables.php fails multiple times Added Project 10 November 2020
T267558: importTextFiles.php not setting content model and thus failing on MW 1.35 Added Project 10 November 2020
T263229: Mathoid demo page not visible with chrome External Code Review In Progress 10 November 2020
T263229: Mathoid demo page not visible with chrome External Code Review Completed 10 November 2020
T148304: Incorrect spacing for \mathbin and \mathrel Inbox 10 November 2020
T148304: Incorrect spacing for \mathbin and \mathrel Waiting for deployment 10 November 2020
T148304: Incorrect spacing for \mathbin and \mathrel Removed Project 10 November 2020
T148304: Incorrect spacing for \mathbin and \mathrel Added Project 10 November 2020
T263229: Mathoid demo page not visible with chrome External Code Review Needed 10 November 2020
T263229: Mathoid demo page not visible with chrome External Code Review In Progress 10 November 2020
T263229: Mathoid demo page not visible with chrome Added Project 10 November 2020
T267520: Translation pages are updated after a long delay on Wikimedia sites Inbox 10 November 2020
T267520: Translation pages are updated after a long delay on Wikimedia sites Waiting for deployment 10 November 2020
T228746: mw.config empty on some pages (and fatal errors emitted) due to Unicode-unaware handling of UTF8 data by Lua Later 10 November 2020
T228746: mw.config empty on some pages (and fatal errors emitted) due to Unicode-unaware handling of UTF8 data by Lua Done 10 November 2020
T228746: mw.config empty on some pages (and fatal errors emitted) due to Unicode-unaware handling of UTF8 data by Lua Added Project 10 November 2020
T263340: "Fatal Exception of Type InvalidArgumentException" when viewing pages with broken history caused by Special:MergeHistory Waiting for Review 9 November 2020
T263340: "Fatal Exception of Type InvalidArgumentException" when viewing pages with broken history caused by Special:MergeHistory Done 9 November 2020
T267520: Translation pages are updated after a long delay on Wikimedia sites Added Project 9 November 2020
T262554: Don't run gadgets on Special:OAuth/authorize Added Project 8 November 2020
T36801: Function applyDiffStyle uses regexes which do not detect CSS classes appropriately Added Project 8 November 2020
T148304: Incorrect spacing for \mathbin and \mathrel External Code Review Needed 5 November 2020
T148304: Incorrect spacing for \mathbin and \mathrel External Code Review In Progress 5 November 2020
T266619: $relPath is false inside thumb_handler.php Added Project 3 November 2020
T266534: Explain and communicate Clinic Duty Stats Inbox 3 November 2020
T266534: Explain and communicate Clinic Duty Stats Later 3 November 2020
T266534: Explain and communicate Clinic Duty Stats Added Project 3 November 2020
T265846: Turn RESTBase tests for /html and /transform endpoints into api-testing integration tests Ready 3 November 2020
T265846: Turn RESTBase tests for /html and /transform endpoints into api-testing integration tests Doing 3 November 2020
T265644: Inject dependencies into ApiMain Removed Project 2 November 2020
T266991: Translate characterEditStats.php script uses Revision::getQueryInfo Added Project 2 November 2020
T266534: Explain and communicate Clinic Duty Stats Removed Project 27 October 2020
T266534: Explain and communicate Clinic Duty Stats Added Project 27 October 2020
T261143: Fix misattribution of block due to bad values in the ipblocks ipb_by_actor field Added Project 22 October 2020
T265846: Turn RESTBase tests for /html and /transform endpoints into api-testing integration tests Later 22 October 2020
T265846: Turn RESTBase tests for /html and /transform endpoints into api-testing integration tests Ready 22 October 2020
T265779: Fatal MWException when trying to rename a page External Code Review Needed 22 October 2020
T265779: Fatal MWException when trying to rename a page External Code Review Completed 22 October 2020
T265779: Fatal MWException when trying to rename a page Added Project 22 October 2020
T51133: Create partial SQL dump of watchlist table Inbox 21 October 2020
T51133: Create partial SQL dump of watchlist table Doing 21 October 2020
T51133: Create partial SQL dump of watchlist table Added Project 21 October 2020
T248686: Allow subclasses of ApiBase to be used in phpunit tests without MediaWiki being initialized Added Project 20 October 2020
T265645: Rewrite UploadWizard's ApiFlickrBlacklistTest to not try to make HTTP requests Inbox 20 October 2020
T265645: Rewrite UploadWizard's ApiFlickrBlacklistTest to not try to make HTTP requests Later 20 October 2020
T265646: Rewrite Math's MathCoverageTest to not try to make HTTP requests Inbox 20 October 2020
T265646: Rewrite Math's MathCoverageTest to not try to make HTTP requests Later 20 October 2020
T265989: Corrupt entries in text table for nlwiktionary causing a lot of MW PHP Warning Inbox 20 October 2020
T265989: Corrupt entries in text table for nlwiktionary causing a lot of MW PHP Warning Doing 20 October 2020
T264951: Wrong title in revision from recentchanges log Inbox 20 October 2020
T264951: Wrong title in revision from recentchanges log Later 20 October 2020
T264951: Wrong title in revision from recentchanges log Added Project 20 October 2020
T265551: Error fetching URL "http://localhost:600...": (curl error: 28) Timeout was reached Inbox 20 October 2020
T265551: Error fetching URL "http://localhost:600...": (curl error: 28) Timeout was reached Later 20 October 2020
T265551: Error fetching URL "http://localhost:600...": (curl error: 28) Timeout was reached Added Project 20 October 2020
T265644: Inject dependencies into ApiMain Inbox 20 October 2020
T265644: Inject dependencies into ApiMain Discussing 20 October 2020
T265644: Inject dependencies into ApiMain Added Project 20 October 2020
T265662: MockHttpTrait fails the whole test suite instead of individual test Inbox 20 October 2020
T265662: MockHttpTrait fails the whole test suite instead of individual test Later 20 October 2020
T265662: MockHttpTrait fails the whole test suite instead of individual test Added Project 20 October 2020
T265846: Turn RESTBase tests for /html and /transform endpoints into api-testing integration tests Inbox 20 October 2020
T265846: Turn RESTBase tests for /html and /transform endpoints into api-testing integration tests Later 20 October 2020
T265846: Turn RESTBase tests for /html and /transform endpoints into api-testing integration tests Added Project 20 October 2020
T265966: Proposal: drop kafka-php dependency from MediaWiki Inbox 20 October 2020
T265966: Proposal: drop kafka-php dependency from MediaWiki Later 20 October 2020
T265966: Proposal: drop kafka-php dependency from MediaWiki Added Project 20 October 2020
T213621: Offer a way to go to the previous or next non-deleted edit in an edit history of a page External Code Review In Progress 20 October 2020
T213621: Offer a way to go to the previous or next non-deleted edit in an edit history of a page External Code Review Completed 20 October 2020
T265989: Corrupt entries in text table for nlwiktionary causing a lot of MW PHP Warning Added Project 20 October 2020
T265663: EventBus tests are failing as they are hitting actual HTTP Added Project 15 October 2020
T265646: Rewrite Math's MathCoverageTest to not try to make HTTP requests Added Project 15 October 2020
T265645: Rewrite UploadWizard's ApiFlickrBlacklistTest to not try to make HTTP requests Added Project 15 October 2020
T265311: Inject UserFactory into classes using DI External Code Review Needed 15 October 2020
T265311: Inject UserFactory into classes using DI External Code Review In Progress 15 October 2020
T243276: Add 'actor' to default $wgSharedTables Later 15 October 2020
T243276: Add 'actor' to default $wgSharedTables Waiting for Review 15 October 2020
T213621: Offer a way to go to the previous or next non-deleted edit in an edit history of a page External Code Review Needed 15 October 2020
T213621: Offer a way to go to the previous or next non-deleted edit in an edit history of a page External Code Review In Progress 15 October 2020
T247194: Convert TrackingCategories to a service with DI Added Project 15 October 2020
T265559: Deprecate $options['specIsArg'] in favor of $spec['spec_is_arg'] Added Project 14 October 2020
T263848: Some push notifications service logs have numeric level codes Inbox 13 October 2020
T263848: Some push notifications service logs have numeric level codes Later 13 October 2020
T263848: Some push notifications service logs have numeric level codes Added Project 13 October 2020
T225897: Cannot access wikitext of some old revisions on Commons, only get a comparison Inbox 13 October 2020
T225897: Cannot access wikitext of some old revisions on Commons, only get a comparison Later 13 October 2020
T225897: Cannot access wikitext of some old revisions on Commons, only get a comparison Added Project 13 October 2020
T213621: Offer a way to go to the previous or next non-deleted edit in an edit history of a page Added Project 13 October 2020
T211910: Don't show misleading messages on Special:Contributions for IP ranges outside the CIDR limit Added Project 13 October 2020
T247675: Stop overriding LogstashFormatter format Inbox 13 October 2020
T247675: Stop overriding LogstashFormatter format Later 13 October 2020
T247675: Stop overriding LogstashFormatter format Added Project 13 October 2020
T264794: SessionManager should not emit Set-Cookies on session renewal Added Project 13 October 2020
T265311: Inject UserFactory into classes using DI Added Project 12 October 2020
T248550: Math extension needs uses of global $wgUser removed External Code Review Needed 7 October 2020
T248550: Math extension needs uses of global $wgUser removed External Code Review Completed 7 October 2020
T260959: MediaWiki\Rest\HttpException should support 3xx codes and wrapped Responses External Code Review Needed 7 October 2020
T260959: MediaWiki\Rest\HttpException should support 3xx codes and wrapped Responses External Code Review Completed 7 October 2020
T253432: Create a User factory External Code Review Needed 7 October 2020
T253432: Create a User factory External Code Review Completed 7 October 2020
T262443: Do not hit actual urls during phpunit tests Waiting for Review 7 October 2020
T262443: Do not hit actual urls during phpunit tests Done 7 October 2020
T264141: 1.34.4 to 1.35.0 update.php db error on PostgreSQL Inbox 6 October 2020
T264141: 1.34.4 to 1.35.0 update.php db error on PostgreSQL Later 6 October 2020
T264745: revisiondelete with multiple ids throws "revdelete-modify-missing" Inbox 6 October 2020
T264745: revisiondelete with multiple ids throws "revdelete-modify-missing" Later 6 October 2020
T264208: Scalar parameter must be a string, number, or MessageValue; got boolean (action=help&recursivesubmodules=1) Inbox 6 October 2020
T264208: Scalar parameter must be a string, number, or MessageValue; got boolean (action=help&recursivesubmodules=1) Later 6 October 2020
T264476: SecurePollContentHandler::getActionOverrides results in broken links Inbox 6 October 2020
T264476: SecurePollContentHandler::getActionOverrides results in broken links Later 6 October 2020
T264476: SecurePollContentHandler::getActionOverrides results in broken links Added Project 6 October 2020
T264479: Special:SecurePoll/edit doesn't always load existing custom message labels Inbox 6 October 2020
T264479: Special:SecurePoll/edit doesn't always load existing custom message labels Later 6 October 2020
T264479: Special:SecurePoll/edit doesn't always load existing custom message labels Added Project 6 October 2020
T264208: Scalar parameter must be a string, number, or MessageValue; got boolean (action=help&recursivesubmodules=1) Added Project 6 October 2020
T264213: ApiThreadAction extends ApiEditPage Added Project 6 October 2020
T264631: Core REST API marks responses as publicly cacheable while issuing set-cookie Inbox 6 October 2020
T264631: Core REST API marks responses as publicly cacheable while issuing set-cookie Doing 6 October 2020
T264745: revisiondelete with multiple ids throws "revdelete-modify-missing" Added Project 6 October 2020
T264631: Core REST API marks responses as publicly cacheable while issuing set-cookie Added Project 5 October 2020
T263133: Move feed assembly from RESTBase to Wikifeeds Waiting for deployment 5 October 2020
T263133: Move feed assembly from RESTBase to Wikifeeds Done 5 October 2020
T263133: Move feed assembly from RESTBase to Wikifeeds Waiting for Review 5 October 2020
T263133: Move feed assembly from RESTBase to Wikifeeds Waiting for deployment 5 October 2020
T258665: Document canonical hook name in hook interfaces Waiting for Review 5 October 2020
T258665: Document canonical hook name in hook interfaces Done 5 October 2020
T93049: Same MassMessage is being sent more than once Later 1 October 2020
T93049: Same MassMessage is being sent more than once Done 1 October 2020
T264141: 1.34.4 to 1.35.0 update.php db error on PostgreSQL Added Project 29 September 2020
T263749: Deletion of a file at Commons fails: Wikimedia\Rdbms\DBTransactionError from line 1519 of /srv/mediawiki/php-1.36.0-wmf.10/includes/libs/rdbms/database/Database.php: Explicit transaction still active. A caller may have caught an error. Open transactions: FileDeleteForm::doDelete Inbox 29 September 2020
T263749: Deletion of a file at Commons fails: Wikimedia\Rdbms\DBTransactionError from line 1519 of /srv/mediawiki/php-1.36.0-wmf.10/includes/libs/rdbms/database/Database.php: Explicit transaction still active. A caller may have caught an error. Open transactions: FileDeleteForm::doDelete Later 29 September 2020
T263601: ApiQueryGlobalUsage.php Undefined index error when accessing $pageIds Inbox 29 September 2020
T263601: ApiQueryGlobalUsage.php Undefined index error when accessing $pageIds Later 29 September 2020
T263749: Deletion of a file at Commons fails: Wikimedia\Rdbms\DBTransactionError from line 1519 of /srv/mediawiki/php-1.36.0-wmf.10/includes/libs/rdbms/database/Database.php: Explicit transaction still active. A caller may have caught an error. Open transactions: FileDeleteForm::doDelete Added Project 29 September 2020
T263340: "Fatal Exception of Type InvalidArgumentException" when viewing pages with broken history caused by Special:MergeHistory Ready 29 September 2020
T263340: "Fatal Exception of Type InvalidArgumentException" when viewing pages with broken history caused by Special:MergeHistory Waiting for Review 29 September 2020
T263601: ApiQueryGlobalUsage.php Undefined index error when accessing $pageIds Added Project 29 September 2020
T263816: Provide direct access to a Guzzle HTTP client Ready 29 September 2020
T263816: Provide direct access to a Guzzle HTTP client Discussing 29 September 2020
T264058: OAuth extension REST tests must not instantiate a Router Inbox 29 September 2020
T264058: OAuth extension REST tests must not instantiate a Router Ready 29 September 2020
T263816: Provide direct access to a Guzzle HTTP client Inbox 29 September 2020
T263816: Provide direct access to a Guzzle HTTP client Ready 29 September 2020
T263925: Hooking into MediaWikiServices with a 1.35-style HookHandler breaks maintenance scripts Inbox 29 September 2020
T263925: Hooking into MediaWikiServices with a 1.35-style HookHandler breaks maintenance scripts Ready 29 September 2020
T263816: Provide direct access to a Guzzle HTTP client Added Project 29 September 2020
T263925: Hooking into MediaWikiServices with a 1.35-style HookHandler breaks maintenance scripts Added Project 29 September 2020
T264058: OAuth extension REST tests must not instantiate a Router Added Project 29 September 2020
T264104: Checkup code claiming that we can share a parse operation with the ongoing edit Inbox 29 September 2020
T264104: Checkup code claiming that we can share a parse operation with the ongoing edit Later 29 September 2020
T264104: Checkup code claiming that we can share a parse operation with the ongoing edit Added Project 29 September 2020
T196906: Sensible default parameters for Monolog logging External Code Review In Progress 29 September 2020
T196906: Sensible default parameters for Monolog logging External Code Review Completed 29 September 2020
T253432: Create a User factory External Code Review Completed 27 September 2020
T253432: Create a User factory External Code Review Needed 27 September 2020
T258665: Document canonical hook name in hook interfaces Inbox 26 September 2020
T258665: Document canonical hook name in hook interfaces Waiting for Review 26 September 2020
T258665: Document canonical hook name in hook interfaces Added Project 26 September 2020
T263811: LocalFile::upload without a user fails in ::recordUpload3 Added Project 24 September 2020
T244058: Strategy for storing parser output for "old revision" (Popular diffs and permalinks) Later 24 September 2020
T244058: Strategy for storing parser output for "old revision" (Popular diffs and permalinks) Discussing 24 September 2020
T244058: Strategy for storing parser output for "old revision" (Popular diffs and permalinks) Doing 24 September 2020
T244058: Strategy for storing parser output for "old revision" (Popular diffs and permalinks) Later 24 September 2020
T263301: Old image unexpectedly overwritten by a revision several years later (after Internal server error) Removed Project 24 September 2020
T254060: ApiUpload allows duplicates when ignorewarnings is set. Removed Project 23 September 2020
T244058: Strategy for storing parser output for "old revision" (Popular diffs and permalinks) Later 23 September 2020
T244058: Strategy for storing parser output for "old revision" (Popular diffs and permalinks) Doing 23 September 2020
T262443: Do not hit actual urls during phpunit tests Doing 23 September 2020
T262443: Do not hit actual urls during phpunit tests Waiting for Review 23 September 2020
T262712: Status 405 Method Not Allowed on /oauth2/request/profile with OPTIONS External Code Review Needed 23 September 2020
T262712: Status 405 Method Not Allowed on /oauth2/request/profile with OPTIONS External Code Review Completed 23 September 2020
T196906: Sensible default parameters for Monolog logging External Code Review Needed 23 September 2020
T196906: Sensible default parameters for Monolog logging External Code Review In Progress 23 September 2020
T263301: Old image unexpectedly overwritten by a revision several years later (after Internal server error) Later 23 September 2020
T263301: Old image unexpectedly overwritten by a revision several years later (after Internal server error) Ready 23 September 2020
T261325: Fix rows in ipblocks that point to a non-existing user in ipb_by_actor field, due to T260485 Waiting for Review 23 September 2020
T261325: Fix rows in ipblocks that point to a non-existing user in ipb_by_actor field, due to T260485 Ready 23 September 2020
T261081: Install from scratch stops with error 1146 "Table 'l10n_cache' does not exist" Waiting for Review 23 September 2020
T261081: Install from scratch stops with error 1146 "Table 'l10n_cache' does not exist" Done 23 September 2020
T263604: findBadBlobs.php unnecessarily requires cleanupTable.inc Doing 23 September 2020
T263604: findBadBlobs.php unnecessarily requires cleanupTable.inc Done 23 September 2020
T263604: findBadBlobs.php unnecessarily requires cleanupTable.inc Inbox 23 September 2020
T263604: findBadBlobs.php unnecessarily requires cleanupTable.inc Doing 23 September 2020
T263604: findBadBlobs.php unnecessarily requires cleanupTable.inc Added Project 23 September 2020
T263301: Old image unexpectedly overwritten by a revision several years later (after Internal server error) Inbox 22 September 2020
T263301: Old image unexpectedly overwritten by a revision several years later (after Internal server error) Later 22 September 2020
T148304: Incorrect spacing for \mathbin and \mathrel Added Project 22 September 2020
T263301: Old image unexpectedly overwritten by a revision several years later (after Internal server error) Added Project 22 September 2020
T263340: "Fatal Exception of Type InvalidArgumentException" when viewing pages with broken history caused by Special:MergeHistory Inbox 22 September 2020
T263340: "Fatal Exception of Type InvalidArgumentException" when viewing pages with broken history caused by Special:MergeHistory Ready 22 September 2020
T263340: "Fatal Exception of Type InvalidArgumentException" when viewing pages with broken history caused by Special:MergeHistory Added Project 22 September 2020
T263530: Table 'metawiki.globaluser' doesn't exist on query Inbox 22 September 2020
T263530: Table 'metawiki.globaluser' doesn't exist on query Later 22 September 2020
T263530: Table 'metawiki.globaluser' doesn't exist on query Added Project 22 September 2020
T243276: Add 'actor' to default $wgSharedTables Later 22 September 2020
T243276: Add 'actor' to default $wgSharedTables Later 22 September 2020
T241837: WMFTimeoutException on Commons for WhatLinksHere Later 22 September 2020
T241837: WMFTimeoutException on Commons for WhatLinksHere Later 22 September 2020
T193565: Foreign query for metawiki fails with "Table 'centralauth.page' doesn't exist" (DBConnRef mixup?) Later 22 September 2020
T193565: Foreign query for metawiki fails with "Table 'centralauth.page' doesn't exist" (DBConnRef mixup?) Later 22 September 2020
T254210: ParameterAssertionException "Bad value for parameter $row->rev_timestamp" from RevisionStoreRecord.php Later 22 September 2020
T254210: ParameterAssertionException "Bad value for parameter $row->rev_timestamp" from RevisionStoreRecord.php Later 22 September 2020
T263295: Setup Git repo and CI for shellbox Inbox 21 September 2020
T263295: Setup Git repo and CI for shellbox Waiting for Review 21 September 2020
T263295: Setup Git repo and CI for shellbox Added Project 21 September 2020
T248237: IPUtils 2.0.0 test failures on MW core Inbox 21 September 2020
T248237: IPUtils 2.0.0 test failures on MW core Waiting for Review 21 September 2020
T248237: IPUtils 2.0.0 test failures on MW core Added Project 21 September 2020
T263033: Remove fallback to `$wgUser` in LocalRepo::findFiles(), FileRepo::findFiles(), and FileRepo::findFileFromKey() Added Project 20 September 2020
T196906: Sensible default parameters for Monolog logging Added Project 20 September 2020
T263133: Move feed assembly from RESTBase to Wikifeeds Doing 18 September 2020
T263133: Move feed assembly from RESTBase to Wikifeeds Waiting for Review 18 September 2020
T259181: Use of Revision::getId was deprecated in MediaWiki 1.31. [Called from MediaWiki\Storage\DerivedPageDataUpdater::grabCurrentRevision] Later 17 September 2020
T259181: Use of Revision::getId was deprecated in MediaWiki 1.31. [Called from MediaWiki\Storage\DerivedPageDataUpdater::grabCurrentRevision] Done 17 September 2020
T252591: REST API endpoints give confusing errors for invalid OAuth2 access tokens Waiting for Review 17 September 2020
T252591: REST API endpoints give confusing errors for invalid OAuth2 access tokens Ready 17 September 2020
T261081: Install from scratch stops with error 1146 "Table 'l10n_cache' does not exist" Doing 17 September 2020
T261081: Install from scratch stops with error 1146 "Table 'l10n_cache' does not exist" Waiting for Review 17 September 2020
T259181: Use of Revision::getId was deprecated in MediaWiki 1.31. [Called from MediaWiki\Storage\DerivedPageDataUpdater::grabCurrentRevision] Waiting for Review 17 September 2020
T259181: Use of Revision::getId was deprecated in MediaWiki 1.31. [Called from MediaWiki\Storage\DerivedPageDataUpdater::grabCurrentRevision] Later 17 September 2020
T257995: Deprecate Skin::makeVariablesScript Waiting for Review 17 September 2020
T257995: Deprecate Skin::makeVariablesScript Later 17 September 2020
T251351: PHP Warning from Xml.php during page deletion: Illegal string offset 'کۆمەڵگە بڕیاری سڕینەوەی داوە' Waiting for Review 17 September 2020
T251351: PHP Warning from Xml.php during page deletion: Illegal string offset 'کۆمەڵگە بڕیاری سڕینەوەی داوە' Waiting for deployment 17 September 2020
T259518: Decide how JOIN tables should be mentioned in IDatabase::select() Waiting for Review 17 September 2020
T259518: Decide how JOIN tables should be mentioned in IDatabase::select() Waiting for deployment 17 September 2020
T258122: *.archives.gov in wgCopyUploadsDomains allowlist doesn't work as URLs are HTTP 302 redirects to s3.amazonaws.com Waiting for Review 17 September 2020
T258122: *.archives.gov in wgCopyUploadsDomains allowlist doesn't work as URLs are HTTP 302 redirects to s3.amazonaws.com Waiting for deployment 17 September 2020
T263133: Move feed assembly from RESTBase to Wikifeeds Inbox 17 September 2020
T263133: Move feed assembly from RESTBase to Wikifeeds Doing 17 September 2020
T263133: Move feed assembly from RESTBase to Wikifeeds Added Project 17 September 2020
T254430: Rdbms overhead due to "SELECT @@GLOBAL.read_only" queries Waiting for Review 17 September 2020
T254430: Rdbms overhead due to "SELECT @@GLOBAL.read_only" queries Done 17 September 2020
T212428: includes/Revision/RevisionStore.php: Main slot of revision (number) not found in database! Later 15 September 2020
T212428: includes/Revision/RevisionStore.php: Main slot of revision (number) not found in database! Ready 15 September 2020
T242360: Update CPT Clinic Duty page with current processes Ready 15 September 2020
T242360: Update CPT Clinic Duty page with current processes Later 15 September 2020
T262960: Fix RESTBase CI tests Inbox 15 September 2020
T262960: Fix RESTBase CI tests Later 15 September 2020
T257995: Deprecate Skin::makeVariablesScript Inbox 15 September 2020
T257995: Deprecate Skin::makeVariablesScript Waiting for Review 15 September 2020
T257995: Deprecate Skin::makeVariablesScript Added Project 15 September 2020
T93049: Same MassMessage is being sent more than once Inbox 15 September 2020
T93049: Same MassMessage is being sent more than once Later 15 September 2020
T93049: Same MassMessage is being sent more than once Added Project 15 September 2020
T262712: Status 405 Method Not Allowed on /oauth2/request/profile with OPTIONS Added Project 15 September 2020
T243276: Add 'actor' to default $wgSharedTables Inbox 15 September 2020
T243276: Add 'actor' to default $wgSharedTables Later 15 September 2020
T243276: Add 'actor' to default $wgSharedTables Added Project 15 September 2020
T262203: Duplicated revision_create events Inbox 15 September 2020
T262203: Duplicated revision_create events Later 15 September 2020
T262203: Duplicated revision_create events Added Project 15 September 2020
T257002: Special:Contributions fails to load contributions with relatively small limit for high-volume users Inbox 15 September 2020
T257002: Special:Contributions fails to load contributions with relatively small limit for high-volume users Later 15 September 2020
T257002: Special:Contributions fails to load contributions with relatively small limit for high-volume users Added Project 15 September 2020
T262958: PasswordError when attempting to create a new user with createAndPromote.php Inbox 15 September 2020
T262958: PasswordError when attempting to create a new user with createAndPromote.php Later 15 September 2020
T262958: PasswordError when attempting to create a new user with createAndPromote.php Added Project 15 September 2020
T262900: Rebuilding l10n cache fails for train Inbox 15 September 2020
T262900: Rebuilding l10n cache fails for train Ready 15 September 2020
T262900: Rebuilding l10n cache fails for train Added Project 15 September 2020
T262960: Fix RESTBase CI tests Added Project 15 September 2020
T254430: Rdbms overhead due to "SELECT @@GLOBAL.read_only" queries Doing 15 September 2020
T254430: Rdbms overhead due to "SELECT @@GLOBAL.read_only" queries Waiting for Review 15 September 2020
T262905: getLocalServerObjectCache() should default to HashBagOStuff in CLI mode. Inbox 15 September 2020
T262905: getLocalServerObjectCache() should default to HashBagOStuff in CLI mode. Waiting for Review 15 September 2020
T262905: getLocalServerObjectCache() should default to HashBagOStuff in CLI mode. Added Project 15 September 2020
T261081: Install from scratch stops with error 1146 "Table 'l10n_cache' does not exist" Ready 15 September 2020
T261081: Install from scratch stops with error 1146 "Table 'l10n_cache' does not exist" Doing 15 September 2020
T254430: Rdbms overhead due to "SELECT @@GLOBAL.read_only" queries Ready 15 September 2020
T254430: Rdbms overhead due to "SELECT @@GLOBAL.read_only" queries Doing 15 September 2020
T254702: GenderCache::getGenderOf uses $wgUser Added Project 15 September 2020
T262874: Remove WikiPage::insertProtectNullRevision Added Project 14 September 2020
T254430: Rdbms overhead due to "SELECT @@GLOBAL.read_only" queries Later 14 September 2020
T254430: Rdbms overhead due to "SELECT @@GLOBAL.read_only" queries Ready 14 September 2020
T262111: Flow uses $wgUser Added Project 14 September 2020
T246861: Deprecate not passing a user to ParserOptions::__construct and ::newCanonical Added Project 13 September 2020
T241903: TimedMediaHandler needs uses of global $wgUser removed Added Project 13 September 2020
T246735: UploadStash accepts an optional user parameter and defaults to $wgUser Added Project 13 September 2020
T241915: Jade needs uses of global $wgUser removed Added Project 13 September 2020
T242677: CodeReview needs uses of global $wgUser removed Added Project 13 September 2020
T262715: UploadWizard needs uses of $wgUser removed Added Project 13 September 2020
T248548: Remove support for not passing a user to callers of RevisionRecord::get* methods when needed Added Project 11 September 2020
T262716: WikibaseQualityConstraints needs use of global $wgUser removed Added Project 11 September 2020
T248550: Math extension needs uses of global $wgUser removed Added Project 11 September 2020
T262706: Remove File::recordUpload Added Project 11 September 2020
T259685: Zeroconf VisualEditor/Parsoid doesn't work on SQLite Added Project 11 September 2020
T226337: SpecialConfirmEmail causes "MWException: CAS update failed on user_touched" from User.php Waiting for Review 11 September 2020
T226337: SpecialConfirmEmail causes "MWException: CAS update failed on user_touched" from User.php Done 11 September 2020
T262462: PHP Notice: Array to string conversion (from EventBus.php) Waiting for Review 11 September 2020
T262462: PHP Notice: Array to string conversion (from EventBus.php) Done 11 September 2020
T260959: MediaWiki\Rest\HttpException should support 3xx codes and wrapped Responses Removed Project 11 September 2020
T260959: MediaWiki\Rest\HttpException should support 3xx codes and wrapped Responses Added Project 11 September 2020
T262443: Do not hit actual urls during phpunit tests Waiting for Review 11 September 2020
T262443: Do not hit actual urls during phpunit tests Doing 11 September 2020
T261369: Deployment infrastructure for PHP microservices Removed Project 10 September 2020
T260959: MediaWiki\Rest\HttpException should support 3xx codes and wrapped Responses Added Project 10 September 2020
T258122: *.archives.gov in wgCopyUploadsDomains allowlist doesn't work as URLs are HTTP 302 redirects to s3.amazonaws.com Doing 10 September 2020
T258122: *.archives.gov in wgCopyUploadsDomains allowlist doesn't work as URLs are HTTP 302 redirects to s3.amazonaws.com Waiting for Review 10 September 2020
T248509: Remove deprecated ways to call WikiPage::doDeleteArticleReal Added Project 10 September 2020
T254060: ApiUpload allows duplicates when ignorewarnings is set. Ready 10 September 2020
T254060: ApiUpload allows duplicates when ignorewarnings is set. Later 10 September 2020
T262457: BlobAccessException: Failed to load data blob from tt:209199: Bad data in text row 209199 Ready 10 September 2020
T262457: BlobAccessException: Failed to load data blob from tt:209199: Bad data in text row 209199 Done 10 September 2020
T262457: BlobAccessException: Failed to load data blob from tt:209199: Bad data in text row 209199 Inbox 10 September 2020
T262457: BlobAccessException: Failed to load data blob from tt:209199: Bad data in text row 209199 Ready 10 September 2020
T262443: Do not hit actual urls during phpunit tests Inbox 10 September 2020
T262443: Do not hit actual urls during phpunit tests Waiting for Review 10 September 2020
T262443: Do not hit actual urls during phpunit tests Added Project 10 September 2020
T255056: MediaWikiIntegrationTestCase::setTemporaryHook needs to support new style hooks Waiting for Review 10 September 2020
T255056: MediaWikiIntegrationTestCase::setTemporaryHook needs to support new style hooks Done 10 September 2020
T247801: Remove support for calling (Archived|OldLocal)File::userCan without passing a user Added Project 10 September 2020
T245704: Remove support for calling LogEventsList::userCan* functions without passing a user object Added Project 10 September 2020
T246412: Remove LogEventsList::typeAction support for rights and use of $wgUser Added Project 10 September 2020
T246413: Remove LogEventsList::getExcludeClause fallback to $wgUser Added Project 9 September 2020
T245801: Remove support for calling FileDeleteForm::doDelete without passing a user object Added Project 9 September 2020
T262462: PHP Notice: Array to string conversion (from EventBus.php) Inbox 9 September 2020
T262462: PHP Notice: Array to string conversion (from EventBus.php) Waiting for Review 9 September 2020
T262462: PHP Notice: Array to string conversion (from EventBus.php) Added Project 9 September 2020
T262457: BlobAccessException: Failed to load data blob from tt:209199: Bad data in text row 209199 Added Project 9 September 2020
T161199: Unable to open edit page for some old revisions "PHP Fatal: Argument passed to EditPage::displayViewSourcePage() must implement interface Content" Waiting for Review 9 September 2020
T161199: Unable to open edit page for some old revisions "PHP Fatal: Argument passed to EditPage::displayViewSourcePage() must implement interface Content" Done 9 September 2020
T244058: Strategy for storing parser output for "old revision" (Popular diffs and permalinks) Later 9 September 2020
T244058: Strategy for storing parser output for "old revision" (Popular diffs and permalinks) Later 9 September 2020
T203075: Warning: MediaWiki\Storage\SqlBlobStore::fetchBlob: Bad data in text row Later 9 September 2020
T203075: Warning: MediaWiki\Storage\SqlBlobStore::fetchBlob: Bad data in text row Later 9 September 2020
T225366: "Fatal exception: MediaWiki\Revision\InvalidArgumentException" when trying to move user JS page on en.wp Later 9 September 2020
T225366: "Fatal exception: MediaWiki\Revision\InvalidArgumentException" when trying to move user JS page on en.wp Later 9 September 2020
T259180: Use of Article::prepareContentForEdit was deprecated in MediaWiki 1.35. [Called from AFComputedVariable::compute] Later 9 September 2020
T259180: Use of Article::prepareContentForEdit was deprecated in MediaWiki 1.35. [Called from AFComputedVariable::compute] Later 9 September 2020
T259179: Use of Article::getContentModel was deprecated in MediaWiki 1.35. [Called from AFComputedVariable::compute] Later 9 September 2020
T259179: Use of Article::getContentModel was deprecated in MediaWiki 1.35. [Called from AFComputedVariable::compute] Later 9 September 2020
T251448: The given Title (XXX) does not belong to page ID during parse, coming from LuaSandbox Later 9 September 2020
T251448: The given Title (XXX) does not belong to page ID during parse, coming from LuaSandbox Later 9 September 2020
T261290: Number of active users from ApiQueryAllUsers grossly different from Special:Statistics page Later 9 September 2020
T261290: Number of active users from ApiQueryAllUsers grossly different from Special:Statistics page Later 9 September 2020
T261282: ApiQueryAllUsers with activeusers=1 includes users with 0 recent actions Later 9 September 2020
T261282: ApiQueryAllUsers with activeusers=1 includes users with 0 recent actions Later 9 September 2020
T258736: Core REST API search results are different from Action API results Later 9 September 2020
T258736: Core REST API search results are different from Action API results Later 9 September 2020
T241638: ContainerDisabledException in ServiceContainer due to failed installation with different language then English Later 9 September 2020
T241638: ContainerDisabledException in ServiceContainer due to failed installation with different language then English Later 9 September 2020
T256296: Fatal exception from FlaggedRevs: "Flagged revision with ID … exists with unexpected fr_page_id" Later 9 September 2020
T256296: Fatal exception from FlaggedRevs: "Flagged revision with ID … exists with unexpected fr_page_id" Later 9 September 2020
T259022: Revision 105215021 belongs to page ID 2442048, the provided Title object belongs to page ID 8437055 Later 9 September 2020
T259022: Revision 105215021 belongs to page ID 2442048, the provided Title object belongs to page ID 8437055 Later 9 September 2020
T258321: Fatal exception of type "MWException" on arzwiki when renaming articles Later 9 September 2020
T258321: Fatal exception of type "MWException" on arzwiki when renaming articles Later 9 September 2020
T231025: LegacyHandler.php: PHP Warning: Host lookup failed [-10002]: Unknown error -10002 Later 9 September 2020
T231025: LegacyHandler.php: PHP Warning: Host lookup failed [-10002]: Unknown error -10002 Later 9 September 2020
T260798: DBQueryError when using rollback on incubatorwiki Later 9 September 2020
T260798: DBQueryError when using rollback on incubatorwiki Later 9 September 2020
T254060: ApiUpload allows duplicates when ignorewarnings is set. Ready 9 September 2020
T254060: ApiUpload allows duplicates when ignorewarnings is set. Ready 9 September 2020
T242360: Update CPT Clinic Duty page with current processes Ready 9 September 2020
T242360: Update CPT Clinic Duty page with current processes Ready 9 September 2020
T254210: ParameterAssertionException "Bad value for parameter $row->rev_timestamp" from RevisionStoreRecord.php Later 9 September 2020
T254210: ParameterAssertionException "Bad value for parameter $row->rev_timestamp" from RevisionStoreRecord.php Later 9 September 2020
T254210: ParameterAssertionException "Bad value for parameter $row->rev_timestamp" from RevisionStoreRecord.php Later 9 September 2020
T254210: ParameterAssertionException "Bad value for parameter $row->rev_timestamp" from RevisionStoreRecord.php Later 9 September 2020
T241837: WMFTimeoutException on Commons for WhatLinksHere Later 9 September 2020
T241837: WMFTimeoutException on Commons for WhatLinksHere Later 9 September 2020
T193565: Foreign query for metawiki fails with "Table 'centralauth.page' doesn't exist" (DBConnRef mixup?) Later 9 September 2020
T193565: Foreign query for metawiki fails with "Table 'centralauth.page' doesn't exist" (DBConnRef mixup?) Later 9 September 2020
T212428: includes/Revision/RevisionStore.php: Main slot of revision (number) not found in database! Later 9 September 2020
T212428: includes/Revision/RevisionStore.php: Main slot of revision (number) not found in database! Later 9 September 2020
T260232: BatchRowIterator slow query on commonswiki Waiting for Review 9 September 2020
T260232: BatchRowIterator slow query on commonswiki Done 9 September 2020
T15079: Improve intersection of transcluded sections and protection Removed Project 8 September 2020
T253594: Tabs may not be valid YAML External Code Review Needed 8 September 2020
T253594: Tabs may not be valid YAML External Code Review Completed 8 September 2020
T253594: Tabs may not be valid YAML External Code Review Needed 8 September 2020
T253594: Tabs may not be valid YAML External Code Review Needed 8 September 2020
T207535: Rendering of \oinit very dense Waiting for deployment 8 September 2020
T207535: Rendering of \oinit very dense Ready 8 September 2020
T207535: Rendering of \oinit very dense Inbox 8 September 2020
T207535: Rendering of \oinit very dense Waiting for deployment 8 September 2020
T207535: Rendering of \oinit very dense Removed Project 8 September 2020
T207535: Rendering of \oinit very dense Added Project 8 September 2020
T244899: CentralAuth should work with postgres Removed Project 8 September 2020
T245244: Conflict resolution process ends with incorrect "This page has been restored" Removed Project 8 September 2020
T137584: Allow Scribunto code to add a category without changing output Removed Project 8 September 2020
T260232: BatchRowIterator slow query on commonswiki Inbox 8 September 2020
T260232: BatchRowIterator slow query on commonswiki Waiting for Review 8 September 2020
T260232: BatchRowIterator slow query on commonswiki Removed Project 8 September 2020
T260232: BatchRowIterator slow query on commonswiki Added Project 8 September 2020
T262175: Remove ApiWatchlistTrait from ApiBase External Code Review Needed 8 September 2020
T262175: Remove ApiWatchlistTrait from ApiBase External Code Review In Progress 8 September 2020
T249521: reassignEdits.php broken External Code Review Needed 8 September 2020
T249521: reassignEdits.php broken External Code Review Completed 8 September 2020
T246539: Dry-run, then actually run updateVarDumps Inbox 8 September 2020
T246539: Dry-run, then actually run updateVarDumps Later 8 September 2020
T258548: PHP error "hash_equals(): Expected known_string to be a string, null given" from OAuth ClientEntity.php Waiting for Review 8 September 2020
T258548: PHP error "hash_equals(): Expected known_string to be a string, null given" from OAuth ClientEntity.php Done 8 September 2020
T261081: Install from scratch stops with error 1146 "Table 'l10n_cache' does not exist" Inbox 8 September 2020
T261081: Install from scratch stops with error 1146 "Table 'l10n_cache' does not exist" Ready 8 September 2020
T261081: Install from scratch stops with error 1146 "Table 'l10n_cache' does not exist" Added Project 8 September 2020
T248022: Remove deprecated api token hooks Added Project 8 September 2020
T262175: Remove ApiWatchlistTrait from ApiBase Added Project 8 September 2020
T261325: Fix rows in ipblocks that point to a non-existing user in ipb_by_actor field, due to T260485 Later 8 September 2020
T261325: Fix rows in ipblocks that point to a non-existing user in ipb_by_actor field, due to T260485 Waiting for Review 8 September 2020
T245707: Remove support for calling PatrolLog::record without passing a user object External Code Review Needed 8 September 2020
T245707: Remove support for calling PatrolLog::record without passing a user object External Code Review Completed 8 September 2020
T259181: Use of Revision::getId was deprecated in MediaWiki 1.31. [Called from MediaWiki\Storage\DerivedPageDataUpdater::grabCurrentRevision] Later 8 September 2020
T259181: Use of Revision::getId was deprecated in MediaWiki 1.31. [Called from MediaWiki\Storage\DerivedPageDataUpdater::grabCurrentRevision] Waiting for Review 8 September 2020
T258736: Core REST API search results are different from Action API results Waiting for Review 7 September 2020
T258736: Core REST API search results are different from Action API results Later 7 September 2020
T246539: Dry-run, then actually run updateVarDumps Added Project 7 September 2020
T226337: SpecialConfirmEmail causes "MWException: CAS update failed on user_touched" from User.php Inbox 4 September 2020

... further results